Unnamed: 0,Unnamed: 1,Unnamed: 2,Unnamed: 3,Unnamed: 4,Unnamed: 5,Unnamed: 6,Unnamed: 7,Unnamed: 8,Unnamed: 9,Unnamed: 10,Unnamed: 11,Unnamed: 12,Unnamed: 13,Unnamed: 14,Unnamed: 15,Unnamed: 16,Unnamed: 17,Unnamed: 18,Unnamed: 19,Unnamed: 20,Unnamed: 21,Unnamed: 22,Unnamed: 23,Unnamed: 24,Unnamed: 25,Unnamed: 26,Unnamed: 27,Unnamed: 28,Unnamed: 29,Unnamed: 30,Unnamed: 31,Unnamed: 32,Unnamed: 33,Unnamed: 34,Unnamed: 35,Unnamed: 36,Unnamed: 37,Unnamed: 38,Unnamed: 39,Unnamed: 40,Unnamed: 41,Unnamed: 42,Unnamed: 43,Unnamed: 44,Unnamed: 45,Unnamed: 46,Unnamed: 47,Unnamed: 48,Unnamed: 49,Unnamed: 50,Unnamed: 51,Unnamed: 52,Unnamed: 53,Unnamed: 54,Unnamed: 55,Unnamed: 56,Unnamed: 57,Unnamed: 58,Unnamed: 59,Unnamed: 60,Unnamed: 61,Unnamed: 62,Unnamed: 63,Unnamed: 64,Unnamed: 65,Unnamed: 66,Unnamed: 67,Unnamed: 68,Unnamed: 69,Unnamed: 70,Unnamed: 71,Unnamed: 72,Unnamed: 73
Bed number,name,hospitalization number,age,gender,,"
Time required to become normal (days)",length of stay (d),nucleic acid negative time (d),oxygen therapy time (d),TCM syndrome score on the first day of treatment(points),TCM syndrome score on the 5th day of treatment(points),TCM syndrome score on the 10th day of treatment(points),,,Pulmonary tuberculosis,hypertension,diabetes,Chronic kidney disease, coronary atherosclerotic heart disease,"Chronic hepatitis B
",,Fever,Cough,Expectorationt,Body pain,Fatigue,Chest tightness,chest pain,Nausea,Vomit,Abdominal pain,Diarrhea,Dry mouth,Poor appetite,Poor sleep,,,,,,,,,,,,,,,,,,,,,,,,,,,,,,,,,,,,,,
63 31,Miao Yunxing,770768,46,Male,,9,21,11,16,22,10,3,,,,,,,,,,1,0,1,1,0,1,0,1,1,0,0,1,0,1,,,,,,,,,,,,,,,,,,,,,,,,,,,,,,,,,,,,,,
62 08,Chen Linchong,770709,43,Male,,9,28,17,13,25,10,6,,,,1,,,,,,1,1,0,0,1,1,1,0,0,1,0,0,1,0,,,,,,,,,,,,,,,,,,,,,,,,,,,,,,,,,,,,,,
63 33,Wang tulin,770606,62,Male,,10,32,9,11,18,5,2,,,,1,,,,,,1,1,1,0,0,1,0,0,0,0,0,0,0,1,,,,,,,,,,,,,,,,,,,,,,,,,,,,,,,,,,,,,,
63 28,Lin Zhenmin,770795,51,Male,,12,30,13,9,20,12,6,,,,1,,,,,,1,1,0,1,1,0,0,0,1,0,1,0,0,0,,,,,,,,,,,,,,,,,,,,,,,,,,,,,,,,,,,,,,
63 107,Chen Aifeng,770509,85,Female,,9,14,19,24,9,5,3,,,1,1,,,,,,1,1,1,0,0,1,0,0,0,0,0,0,1,1,,,,,,,,,,,,,,,,,,,,,,,,,,,,,,,,,,,,,,
63 20,Zhuge Jianmin,771430,49,Male,,6,24,22,9,17,15,1,,,,,,,,,,0,0,1,0,1,1,1,1,0,0,0,1,0,1,,,,,,,,,,,,,,,,,,,,,,,,,,,,,,,,,,,,,,
63 17,Lou Xiaoyu,771609,57,Female,,6,27,8,8,21,13,3,,,,,,,1,,,1,1,1,0,1,1,0,0,0,1,0,0,0,0,,,,,,,,,,,,,,,,,,,,,,,,,,,,,,,,,,,,,,
63 04,Li Yuqi,771444,69,Female,,6,29,17,7,21,13,3,,,,,,,,,,0,0,1,1,1,0,1,0,0,0,0,0,1,1,,,,,,,,,,,,,,,,,,,,,,,,,,,,,,,,,,,,,,
61 20,Zheng Xianhong,771245,48,Female,,6,24,27,6,16,8,0,,,,,,,,,,1,1,1,0,0,1,0,0,0,0,1,0,1,0,,,,,,,,,,,,,,,,,,,,,,,,,,,,,,,,,,,,,,
63  05,Ye linhui,771601,76,Male,,13,27,11,8,16,2,3,,,1,,,,,,,1,1,1,1,1,1,1,0,0,1,0,0,0,1,,,,,,,,,,,,,,,,,,,,,,,,,,,,,,,,,,,,,,
62 09,Gao Xiangmei,771682,62,Female,,7,21,26,9,16,10,6,,,,1,,,,,,1,1,0,0,0,0,0,0,1,0,0,1,1,0,,,,,,,,,,,,,,,,,,,,,,,,,,,,,,,,,,,,,,
63 19,Li Shengyan,771524,56,Female,,8,26,12,15,10,14,2,,,,,,,,,,1,0,1,1,1,1,0,0,0,0,0,0,0,1,,,,,,,,,,,,,,,,,,,,,,,,,,,,,,,,,,,,,,
63 07,Ye Yunyu,770525,55,Female,,6,16,20,15,20,13,3,,,,1,,,,,,1,1,1,1,1,1,1,0,0,0,0,0,1,1,,,,,,,,,,,,,,,,,,,,,,,,,,,,,,,,,,,,,,
63 04,Shao Heguo,770478,41,Male,,5,23,25,16,15,8,1,,,,1,,,,,,1,0,0,0,1,0,0,1,0,0,0,1,0,0,,,,,,,,,,,,,,,,,,,,,,,,,,,,,,,,,,,,,,
63 32,Zheng chenjing,770517,55,Male,,6,22,18,21,25,12,3,,,,,1,,,,,1,1,1,0,1,1,0,0,1,0,0,0,0,1,,,,,,,,,,,,,,,,,,,,,,,,,,,,,,,,,,,,,,
61 15,Chen Xiaoyun,771605,53,Female,,4,20,12,20,24,12,2,,,,1,1,,1,,,1,1,1,0,1,0,0,1,0,0,0,0,1,0,,,,,,,,,,,,,,,,,,,,,,,,,,,,,,,,,,,,,,
61 29,Hu Xiaoqing,770291,39,Female,,5,9,11,8,16,13,3,,,,,,,,,,1,1,0,0,1,1,0,0,1,0,0,1,0,1,,,,,,,,,,,,,,,,,,,,,,,,,,,,,,,,,,,,,,
61 26,Shen Liangjie,770273,28,Female,,5,11,19,5,25,7,0,,,,,,,,,,1,1,1,0,1,1,0,0,0,0,0,0,1,0,,,,,,,,,,,,,,,,,,,,,,,,,,,,,,,,,,,,,,
63  35,Korea and Canada,769861,46,Male,,13,17,19,13,16,15,9,,,,1,,,,,,1,1,0,0,1,0,0,0,0,1,0,0,1,1,,,,,,,,,,,,,,,,,,,,,,,,,,,,,,,,,,,,,,
63 30 ,Li Haiou,770359,48,Female,,15,38,20,17,23,24,6,,,,1,,,,,,1,1,0,1,1,1,1,0,0,0,0,0,0,1,,,,,,,,,,,,,,,,,,,,,,,,,,,,,,,,,,,,,,
63 11,Wang Xiaomei,00000001,64,Female,,6,18,26,15,25,18,6,,,,,,,,,,1,1,1,0,1,0,0,0,1,0,0,0,1,0,,,,,,,,,,,,,,,,,,,,,,,,,,,,,,,,,,,,,,
63 18,Huang Xuelian,771753,66,Male,,16,24,18,24,21,1,3,,,,1,,1,,,,1,1,0,0,0,1,1,0,0,0,1,0,0,1,,,,,,,,,,,,,,,,,,,,,,,,,,,,,,,,,,,,,,
63 30 ,Liao Kongli,770513,67,Male,,13,38,17,14,24,14,3,,,,1,,,,,,1,1,1,0,1,1,0,0,1,0,0,0,0,0,,,,,,,,,,,,,,,,,,,,,,,,,,,,,,,,,,,,,,
62 18,Chen Litang,770655,46,Male,,4,23,21,11,16,12,0,,,,1,,,,,,0,0,1,1,0,0,0,0,0,0,0,0,1,1,,,,,,,,,,,,,,,,,,,,,,,,,,,,,,,,,,,,,,
63 104,Ye Shengjian,770378,59,Male,,4,13,20,22,20,13,9,,,,,,,,1,,1,1,0,0,1,1,0,0,0,1,0,0,0,0,,,,,,,,,,,,,,,,,,,,,,,,,,,,,,,,,,,,,,
61 31,Wang Kai,770436,28,Male,,14,29,17,15,24,6,6,,,,,,,,,,1,1,1,0,0,1,1,1,0,0,0,1,1,0,,,,,,,,,,,,,,,,,,,,,,,,,,,,,,,,,,,,,,
63 15,Huang Xiaoshi,770854,27,Female,,15,29.3497,25,14.8608,19,9,6,,,,,,,,,,1,0,0,0,0,1,0,0,1,0,0,0,0,1,,,,,,,,,,,,,,,,,,,,,,,,,,,,,,,,,,,,,,
62 05,Lin Lanqing,770792,53,Female,,9,28,20,12.4368,21,18,6,,,,,1,,,,,0,1,1,0,1,1,0,0,0,1,0,1,1,0,,,,,,,,,,,,,,,,,,,,,,,,,,,,,,,,,,,,,,
61 15,Zhou Huilin,770843,30,Female,,7,37.2327,19,19.2049,20,6,9,,,,,,,,,,1,1,1,0,1,1,0,1,0,0,0,0,0,0,,,,,,,,,,,,,,,,,,,,,,,,,,,,,,,,,,,,,,
63 13,Ye Lin,770518,31,Female,,8,33,18,15.0546,12,8,9,,,,,,,,,,1,0,1,1,1,0,0,0,1,0,0,1,0,1,,,,,,,,,,,,,,,,,,,,,,,,,,,,,,,,,,,,,,
61 05,Lin Shengshuang,771048,28,Female,,10,28,20,15.6116,20,23,6,,,,,,,,,,1,1,0,0,0,1,0,1,0,0,0,0,0,0,,,,,,,,,,,,,,,,,,,,,,,,,,,,,,,,,,,,,,
63 25,Zheng Yong,771409,69,Male,,9,30.7459,26,19.5794,26,9,9,,,,1,,,,,,0,1,1,0,1,1,0,1,0,0,0,1,0,1,,,,,,,,,,,,,,,,,,,,,,,,,,,,,,,,,,,,,,
62 06,Bai Yunyi,770791,57,Male,,13,28,15,27.535,21,19,8,,,,1,,,,,,1,1,1,1,0,1,0,0,0,0,1,0,1,1,,,,,,,,,,,,,,,,,,,,,,,,,,,,,,,,,,,,,,
,,,,,,,,,,,,,,,,,,,,,,,,,,,,,,,,,,,,,,,,,,,,,,,,,,,,,,,,,,,,,,,,,,,,,,,,,
,,,,,,,,,,,,,,,,,,,,,,,,,,,,,,,,,,,,,,,,,,,,,,,,,,,,,,,,,,,,,,,,,,,,,,,,,
,,,,,,,,,,,,,,,,,,,,,,,,,,,,,,,,,,,,,,,,,,,,,治疗组：治疗第一天VS第五天  t=6.071 p=0.000,,,,,,,,对照组：治疗第一天VS第五天  t=3.836 p=0.001,,,,,,,,,,,,,,,,,,,,
,,,,,,,,,,,,,,,,,,,,,,,,,,,,,,,,,,,,,,,,,,,,,,,,,,,,,,,,,,,,,,,,,,,,,,,,,
,,,,,,,,,,,,,,,,,,,,,,,,,,,,,,,,,,,,,,,,,,,,,,,,,,,,,,,,,,,,,,,,,,,,,,,,,
,,,,,,,,,,,,,,,,,,,,,,,,,,,,,,,,,,,,,,,,,,,,,,,,,,,,,,,,,,,,,,,,,,,,,,,,,
,,,,,,,,,,,,,,,,,,,,,,,,,,,,,,,,,,,,,,,,,,,,,,,,,,,,,,,,,,,,,,,,,,,,,,,,,
,,,,,,,,,,,,,,,,,,,,,,,,,,,,,,,,,,,,,,,,,,,,,,治疗组：治疗第1天VS第10天  t=13.204 p=0.000,,,,,,,,,,,,,,,,,,,,,,,,,,,
,,,,,,,,,,,,,,,,,,,,,,,,,,,,,,,,,,,,,,,,,,,,,,,,,,,,,对照组：治疗第1天VS第10天  t=11.899 p=0.000,,,,,,,,,,,,,,,,,,,,
,,,,,,,,,,,,,,,,,,,,,,,,,,,,,,,,,,,,,,,,,,,,,,,,,,,,,,,,,,,,,,,,,,,,,,,,,
,,,,,,,,,,,,,,,,,,,,,,,,,,,,,,,,,,,,,,,,,,,,,,,,,,,,,,,,,,,,,第10天之间比较   t=4.527 p=0.000,,,,,,,,,,,,
,,,,,,,,,,,,,,,,,,,,,,,,,,,,,,,,,,,,,,,,,,,,,,,,,,,,,,,,,,,,,,,,,,,,,,,,,
,,,,,,,,,,,,,,,,,,,,,,,,,,,,,,,,,,,,,,,,,,,1.0,0.0,,,0.0,9.0,,33.0,,,,,,,,,,,,,,,,,,,1.0,,,1.0,1.0
,,,,,,,,,,,,,,,,,,,,,,,,,,,,,,,,,,,,,,,,,,,1.0,0.0,,,0.0,24.0,,27.0,2.5,149.0,4.53,0.6,25.1,93.0,39.6,68.0,80.0,3.5,64,26.7,0.14,22.0,,,1.0,,1.0,,,,1.0
